{"text_format":"1","workbook":"xlsx","n_sheets":5,"sheets":["LISTE ENGAGES","EMARG","Results_16","Tableau_16","RELEVE"],"not_rendered":{"charts":0,"images":6,"macros":1,"external_links":0,"defined_names":28,"comments":0,"pivot_tables":0},"unopened":[],"bounds":{"document_bytes":16777216,"sheet_cells":100000,"rows_first":2000,"rows_last":500,"rows_between":2000,"halvings":0,"cell_chars":16384,"cell_head_chars":4096},"cells_cut":0,"cells_raw":0,"read":"whole","date_system":"1900"}

{"sheet":"LISTE ENGAGES","index":0,"n_rows":34,"n_cols":36,"rows_kept":34,"cut":false,"hidden":false,"merged":[[12,13,12,17],[0,2,2,6],[0,7,2,7],[3,2,3,3],[4,2,4,7],[5,2,5,7],[11,13,11,17]]}
[null,null,{"$f":"IF($Q$3=\"\",$P$3,$Q$3)","v":"APPELATION TOURNOI"},null,null,null,null,{"$f":"IF(Q10=\"\",P10,Q10)","v":"ORGANISATEUR"}]
[null,null,null,null,null,null,null,null,null,null,null,null,null,null,null,null,"IDENTITE DU TOURNOI"]
[null,null,null,null,null,null,null,null,null,null,null,null,null,null,null,"APPELATION TOURNOI"]
[null,null,{"$f":"IF($Q$4=\"\",$P$4,$Q$4)","v":"LIEU"},null,null,null,{"$f":"IF(Q7=\"\",\"DATE\",CONCATENATE(Q7,\"-\",Q8,\"/\",Q6))","v":"DATE"},{"$f":"IF(Q9=\"\",P9,Q9)","v":"GENRE"},null,null,null,null,null,null,null,"LIEU"]
[null,null,{"$f":"IF(Q5=\"\",P5,Q5)","v":"TYPE"},null,null,null,null,null,null,null,null,null,null,null,null,"TYPE"]
[null,null,"LISTE EQUIPES ENGAGEES",null,null,null,null,null,null,null,null,null,null,null,null,"ANNEE",null,null,null,null,null,null,null,null,null,null,null,null,null,"CHAMPIONNAT DE France",null,2020,null,"MASCULIN",null,"ABS"]
[null,null,null,null,null,null,null,null,null,null,null,null,null,null,null,"DATE DEBUT",null,null,null,null,null,null,null,null,null,null,null,null,null,"SERIE 1 - 2500",null,2021,null,"FEMININ",null,1]
["N°",null,"NOM","PRENOM","LICENCE","CLUB","NOM","PRENOM","LICENCE","CLUB","pts","tir",null,null,null,"DATE FIN",null,null,null,null,null,null,null,null,null,null,null,null,null,"SERIE 1 - 2000",null,2022,null,"MIXTE",null,2]
[1,null,null,null,null,null,null,null,null,null,null,null,null,null,null,"GENRE",null,null,null,null,null,null,null,null,null,null,null,null,null,"SERIE 1 - 1500",null,2023,null,null,null,3]
[2,null,null,null,null,null,null,null,null,null,null,null,null,null,null,"ORGANISATEUR",null,null,null,null,null,null,null,null,null,null,null,null,null,"SERIE 2 - 1000",null,2024,null,null,null,4]
[3,null,null,null,null,null,null,null,null,null,null,null,null,null,null,null,null,null,null,null,null,null,null,null,null,null,null,null,null,"SERIE 2 - 750",null,null,null,null,null,5]
[4,null,null,null,null,null,null,null,null,null,null,null,null,"1- Commencez par renseigner le tableau ci-dessus \"identité du tournoi\"",null,null,null,null,null,null,null,null,null,null,null,null,null,null,null,"SERIE 2 - 500",null,null,null,null,null,7]
[5,null,null,null,null,null,null,null,null,null,null,null,null,"2- Copiez-collez la liste des équipes engagées dans les champs ci-contre en respectant : ",null,null,null,null,null,null,null,null,null,null,null,null,null,null,null,"SERIE 2 - 250",null,null,null,null,null,9]
[6,null,null,null,null,null,null,null,null,null,null,null,null,"- nom et premon séparés pour chaque joueur ( à défaut, ne mentionez que le nom)",null,null,null,null,null,null,null,null,null,null,null,null,null,null,null,"SERIE 3 - 150",null,null,null,null,null,13]
[7,null,null,null,null,null,null,null,null,null,null,null,null,"- l'ordre décroissant des têtes de séries",null,null,null,null,null,null,null,null,null,null,null,null,null,null,null,"SERIE 3 - 100"]
[8,null,null,null,null,null,null,null,null,null,null,null,null,"3- Renseignez l'onglet \"EMARG….\" selon l'avancée dans les tableaux"]
[9,null,null,null,null,null,null,null,null,null,null,null,null,"4-Renseignez les scores des rencontres dans l'onglet \" Résultats…\" en fonction de l'avancée du tableau"]
[10,null,null,null,null,null,null,null,null,null,null,null,null,"Les onglets \"TAB…\" s'actualisent automatiquement, il n'y a rien à saisir."]
[11,null,null,null,null,null,null,null,null,null,null,null,null,"5- Renseignez l'onglet \"RELEVE\" à l'issue de la compétition"]
[12]
[13]
[14]
[15]
[16]
[17]
[18]
[19]
[20]
[21]
[22]
[23]
[24]
[25]
[26]

{"sheet":"EMARG","index":1,"n_rows":25,"n_cols":9,"rows_kept":25,"cut":false,"hidden":false,"merged":[[1,2,2,7],[1,8,3,8],[4,2,4,8],[5,2,5,8],[3,2,3,5]]}
[]
[null,null,{"$f":"IF('LISTE ENGAGES'!Q3<>\" \",'LISTE ENGAGES'!P3,'LISTE ENGAGES'!Q3)","v":"APPELATION TOURNOI"},null,null,null,null,null,{"$f":"IF('LISTE ENGAGES'!Q10=\"\",'LISTE ENGAGES'!P10,'LISTE ENGAGES'!Q10)","v":"ORGANISATEUR"}]
[]
[null,null,{"$f":"IF('LISTE ENGAGES'!Q4<>\" \",'LISTE ENGAGES'!P4,'LISTE ENGAGES'!Q4)","v":"LIEU"},null,null,null,{"$f":"'LISTE ENGAGES'!G4","v":"DATE"},{"$f":"'LISTE ENGAGES'!H4","v":"GENRE"}]
[null,null,{"$f":"'LISTE ENGAGES'!C5:H5","v":"TYPE"}]
[null,null,"FEUILLE EMARGEMENT"]
[]
[]
["Rang","NOM JOUEUR 1","PRENOM","NOM JOUEUR 2","PRENOM","Points","SIGNATURE JOUEUR 1","SIGNATURE JOUEUR 2","NOM D'EQUIPE\nJOUEUR 1/ JOUEUR 2"]
[1,null,null,null,null,null,null,null,{"$f":"CONCATENATE(B10,\" / \",D10)","v":" / "}]
[2,null,null,null,null,null,null,null," / "]
[3,null,null,null,null,null,null,null," / "]
[4,null,null,null,null,null,null,null," / "]
[5,null,null,null,null,null,null,null," / "]
[6,null,null,null,null,null,null,null," / "]
[7,null,null,null,null,null,null,null," / "]
[8,null,null,null,null,null,null,null," / "]
[9,null,null,null,null,null,null,null," / "]
[10,null,null,null,null,null,null,null," / "]
[11,null,null,null,null,null,null,null," / "]
[12,null,null,null,null,null,null,null," / "]
[13,null,null,null,null,null,null,null," / "]
[14,null,null,null,null,null,null,null," / "]
[15,null,null,null,null,null,null,null," / "]
[16,null,null,null,null,null,null,null," / "]

{"sheet":"Results_16","index":2,"n_rows":31,"n_cols":25,"rows_kept":31,"cut":false,"hidden":false,"merged":[]}
["N° match","Tour","Court","Horaire","Equipe 1","vs","Equipe 2","Resultat",null,null,"durée","1. Set",null,null,"2. Set",null,null,"3. Set",null,null,"heure début","heure fin",null,"Rang","EQUIPE"]
[1,"I",null,null,{"$f":"IF(EMARG!$I$10=\" / \",CONCATENATE(\"TS #\",EMARG!$A$10),EMARG!$I$10)","v":"TS #1"},"vs",{"$f":"IF(EMARG!$I$25=\" / \",CONCATENATE(\"TS #\",EMARG!$A$25),EMARG!$I$25)","v":"TS #16"},{"$f":"IF(L2=N2,\"\",SUM(IF(L2>N2,1,0),IF(O2>Q2,1,0),IF(R2<=T2,0,1)))","v":""},"<->",{"$f":"IF(L2=N2,\"\",SUM(IF(L2<N2,1,0),IF(O2<Q2,1,0),IF(R2>=T2,0,1)))","v":""},{"$f":"SUM(V2-U2)","v":"00:00:00"},null,"<->",null,null,"<->",null,null,"<->",null,null,null,null,1,{"$f":"IF(Results_16!$H$31=Results_16!$J$31,\"1. Rang\",IF(Results_16!$H$31>Results_16!$J$31,Results_16!$E$31,Results_16!$G$31))","v":"1. Rang"}]
[{"$f":"SUM(A2,1)","v":2},"I",null,null,{"$f":"IF(EMARG!$I$18=\" / \",CONCATENATE(\"TS #\",EMARG!$A$18),EMARG!$I$18)","v":"TS #9"},"vs",{"$f":"IF(EMARG!$I$17=\" / \",CONCATENATE(\"TS #\",EMARG!$A$17),EMARG!$I$17)","v":"TS #8"},"","<->","","00:00:00",null,"<->",null,null,"<->",null,null,"<->",null,null,null,null,{"$f":"SUM(X2,1)","v":2},{"$f":"IF(Results_16!$H$31=Results_16!$J$31,\"2. Rang\",IF(Results_16!$H$31<Results_16!$J$31,Results_16!$E$31,Results_16!$G$31))","v":"2. Rang"}]
[3,"I",null,null,{"$f":"IF(EMARG!$I$14=\" / \",CONCATENATE(\"TS #\",EMARG!$A$14),EMARG!$I$14)","v":"TS #5"},"vs",{"$f":"IF(EMARG!$I$21=\" / \",CONCATENATE(\"TS #\",EMARG!$A$21),EMARG!$I$21)","v":"TS #12"},"","<->","","00:00:00",null,"<->",null,null,"<->",null,null,"<->",null,null,null,null,{"$f":"SUM(X3,1)","v":3},{"$f":"IF(Results_16!$H$30=Results_16!$J$30,\"3. Rang\",IF(Results_16!$H$30>Results_16!$J$30,Results_16!$E$30,Results_16!$G$30))","v":"3. Rang"}]
[4,"I",null,null,{"$f":"IF(EMARG!$I$22=\" / \",CONCATENATE(\"TS #\",EMARG!$A$22),EMARG!$I$22)","v":"TS #13"},"vs",{"$f":"IF(EMARG!$I$13=\" / \",CONCATENATE(\"TS #\",EMARG!$A$13),EMARG!$I$13)","v":"TS #4"},"","<->","","00:00:00",null,"<->",null,null,"<->",null,null,"<->",null,null,null,null,{"$f":"SUM(X4,1)","v":4},{"$f":"IF(Results_16!$H$30=Results_16!$J$30,\"4. Rang\",IF(Results_16!$H$30<Results_16!$J$30,Results_16!$E$30,Results_16!$G$30))","v":"4. Rang"}]
[5,"I",null,null,{"$f":"IF(EMARG!$I$12=\" / \",CONCATENATE(\"TS #\",EMARG!$A$12),EMARG!$I$12)","v":"TS #3"},"vs",{"$f":"IF(EMARG!$I$23=\" / \",CONCATENATE(\"TS #\",EMARG!$A$23),EMARG!$I$23)","v":"TS #14"},"","<->","","00:00:00",null,"<->",null,null,"<->",null,null,"<->",null,null,null,null,{"$f":"SUM(X5,1)","v":5},{"$f":"IF(Results_16!$H$26=Results_16!$J$26,\"5. Rang\",IF(Results_16!$H$26<Results_16!$J$26,Results_16!$E$26,Results_16!$G$26))","v":"5. Rang"}]
[6,"I",null,null,{"$f":"IF(EMARG!$I$20=\" / \",CONCATENATE(\"TS #\",EMARG!$A$20),EMARG!$I$20)","v":"TS #11"},"vs",{"$f":"IF(EMARG!$I$15=\" / \",CONCATENATE(\"TS #\",EMARG!$A$15),EMARG!$I$15)","v":"TS #6"},"","<->","","00:00:00",null,"<->",null,null,"<->",null,null,"<->",null,null,null,null,5,{"$f":"IF(Results_16!$H$27=Results_16!$J$27,\"5. Rang\",IF(Results_16!$H$27<Results_16!$J$27,Results_16!$E$27,Results_16!$G$27))","v":"5. Rang"}]
[7,"I",null,null,{"$f":"IF(EMARG!$I$16=\" / \",CONCATENATE(\"TS #\",EMARG!$A$16),EMARG!$I$16)","v":"TS #7"},"vs",{"$f":"IF(EMARG!$I$19=\" / \",CONCATENATE(\"TS #\",EMARG!$A$19),EMARG!$I$19)","v":"TS #10"},"","<->","","00:00:00",null,"<->",null,null,"<->",null,null,"<->",null,null,null,null,7,{"$f":"IF(Results_16!$H$24=Results_16!$J$24,\"7. Rang\",IF(Results_16!$H$24<Results_16!$J$24,Results_16!$E$24,Results_16!$G$24))","v":"7. Rang"}]
[8,"I",null,null,{"$f":"IF(EMARG!$I$24=\" / \",CONCATENATE(\"TS #\",EMARG!$A$24),EMARG!$I$24)","v":"TS #15"},"vs",{"$f":"IF(EMARG!$I$11=\" / \",CONCATENATE(\"TS #\",EMARG!$A$11),EMARG!$I$11)","v":"TS #2"},"","<->","","00:00:00",null,"<->",null,null,"<->",null,null,"<->",null,null,null,null,7,{"$f":"IF(Results_16!$H$25=Results_16!$J$25,\"7. Rang\",IF(Results_16!$H$25<Results_16!$J$25,Results_16!$E$25,Results_16!$G$25))","v":"7. Rang"}]
[9,13,null,null,{"$f":"IF($H$2=$J$2,CONCATENATE(\"Perdant Match #\",$A$2),IF($H$2<$J$2,E2,$G$2))","v":"Perdant Match #1"},"vs",{"$f":"IF($H$3=$J$3,CONCATENATE(\"Perdant Match #\",$A$3),IF($H$3<$J$3,E3,$G$3))","v":"Perdant Match #2"},"","<->","","00:00:00",null,"<->",null,null,"<->",null,null,"<->",null,null,null,null,9,{"$f":"IF(Results_16!$H$18=Results_16!$J$18,\"9. Rang\",IF(Results_16!$H$18<Results_16!$J$18,Results_16!$E$18,Results_16!$G$18))","v":"9. Rang"}]
[10,13,null,null,{"$f":"IF($H$4=$J$4,CONCATENATE(\"Perdant Match #\",$A$4),IF($H$4<$J$4,E4,$G$4))","v":"Perdant Match #3"},"vs",{"$f":"IF($H$5=$J$5,CONCATENATE(\"Perdant Match #\",$A$5),IF($H$5<$J$5,$E$5,$G$5))","v":"Perdant Match #4"},"","<->","","00:00:00",null,"<->",null,null,"<->",null,null,"<->",null,null,null,null,9,{"$f":"IF(Results_16!$H$19=Results_16!$J$19,\"9. Rang\",IF(Results_16!$H$19<Results_16!$J$19,Results_16!$E$19,Results_16!$G$19))","v":"9. Rang"}]
[11,13,null,null,{"$f":"IF($H$6=$J$6,CONCATENATE(\"Perdant Match #\",$A$6),IF($H$6<$J$6,E6,$G$6))","v":"Perdant Match #5"},"vs",{"$f":"IF($H$7=$J$7,CONCATENATE(\"Perdant Match #\",$A$7),IF($H$7<$J$7,E7,$G$7))","v":"Perdant Match #6"},"","<->","","00:00:00",null,"<->",null,null,"<->",null,null,"<->",null,null,null,null,9,{"$f":"IF(Results_16!$H$20=Results_16!$J$20,\"9. Rang\",IF(Results_16!$H$20<Results_16!$J$20,Results_16!$E$20,Results_16!$G$20))","v":"9. Rang"}]
[12,13,null,null,{"$f":"IF($H$8=$J$8,CONCATENATE(\"Perdant Match #\",$A$8),IF($H$8<$J$8,E8,$G$8))","v":"Perdant Match #7"},"vs",{"$f":"IF($H$9=$J$9,CONCATENATE(\"Perdant Match #\",$A$9),IF($H$9<$J$9,E9,$G$9))","v":"Perdant Match #8"},"","<->","","00:00:00",null,"<->",null,null,"<->",null,null,"<->",null,null,null,null,9,{"$f":"IF(Results_16!$H$21=Results_16!$J$21,\"9. Rang\",IF(Results_16!$H$21<Results_16!$J$21,Results_16!$E$21,Results_16!$G$21))","v":"9. Rang"}]
[13,"II",null,null,{"$f":"IF($H$2=$J$2,CONCATENATE(\"Gagnant Match #\",$A$2),IF($H$2>$J$2,E2,$G$2))","v":"Gagnant Match #1"},"vs",{"$f":"IF($H$3=$J$3,CONCATENATE(\"Gagnant Match #\",$A$3),IF($H$3>$J$3,E3,$G$3))","v":"Gagnant Match #2"},"","<->","","00:00:00",null,"<->",null,null,"<->",null,null,"<->",null,null,null,null,13,{"$f":"IF(Results_16!$H$10=Results_16!$J$10,\"13. Rang\",IF(Results_16!$H$10<Results_16!$J$10,Results_16!$E$10,Results_16!$G$10))","v":"13. Rang"}]
[14,"II",null,null,{"$f":"IF($H$4=$J$4,CONCATENATE(\"Gagnant Match #\",$A$4),IF($H$4>$J$4,E4,$G$4))","v":"Gagnant Match #3"},"vs",{"$f":"IF($H$5=$J$5,CONCATENATE(\"Gagnant Match #\",$A$5),IF($H$5>$J$5,E5,$G$5))","v":"Gagnant Match #4"},"","<->","","00:00:00",null,"<->",null,null,"<->",null,null,"<->",null,null,null,null,13,{"$f":"IF(Results_16!$H$11=Results_16!$J$11,\"13. Rang\",IF(Results_16!$H$11<Results_16!$J$11,Results_16!$E$11,Results_16!$G$11))","v":"13. Rang"}]
[15,"II",null,null,{"$f":"IF($H$6=$J$6,CONCATENATE(\"Gagnant Match #\",$A$6),IF($H$6>$J$6,E6,$G$6))","v":"Gagnant Match #5"},"vs",{"$f":"IF($H$7=$J$7,CONCATENATE(\"Gagnant Match #\",$A$7),IF($H$7>$J$7,E7,$G$7))","v":"Gagnant Match #6"},"","<->","","00:00:00",null,"<->",null,null,"<->",null,null,"<->",null,null,null,null,13,{"$f":"IF(Results_16!$H$12=Results_16!$J$12,\"13. Rang\",IF(Results_16!$H$12<Results_16!$J$12,Results_16!$E$12,Results_16!$G$12))","v":"13. Rang"}]
[16,"II",null,null,{"$f":"IF($H$8=$J$8,CONCATENATE(\"Gagnant Match #\",$A$8),IF($H$8>$J$8,E8,$G$8))","v":"Gagnant Match #7"},"vs",{"$f":"IF($H$9=$J$9,CONCATENATE(\"Gagnant Match #\",$A$9),IF($H$9>$J$9,E9,$G$9))","v":"Gagnant Match #8"},"","<->","","00:00:00",null,"<->",null,null,"<->",null,null,"<->",null,null,null,null,13,{"$f":"IF(Results_16!$H$13=Results_16!$J$13,\"13. Rang\",IF(Results_16!$H$13<Results_16!$J$13,Results_16!$E$13,Results_16!$G$13))","v":"13. Rang"}]
[17,9,null,null,{"$f":"IF($H$13=$J$13,CONCATENATE(\"Gagnant Match #\",$A$13),IF($H$13>$J$13,$E$13,$G$13))","v":"Gagnant Match #12"},"vs",{"$f":"IF($H$14=$J$14,CONCATENATE(\"Perdant Match #\",$A$14),IF($H$14<$J$14,E14,$G$14))","v":"Perdant Match #13"},"","<->","","00:00:00",null,"<->",null,null,"<->",null,null,"<->"]
[18,9,null,null,{"$f":"IF($H$12=$J$12,CONCATENATE(\"Gagnant Match #\",$A$12),IF($H$12>$J$12,$E$12,$G$12))","v":"Gagnant Match #11"},"vs",{"$f":"IF($H$15=$J$15,CONCATENATE(\"Perdant Match #\",$A$15),IF($H$15<$J$15,E15,$G$15))","v":"Perdant Match #14"},"","<->","","00:00:00",null,"<->",null,null,"<->",null,null,"<->"]
[19,9,null,null,{"$f":"IF($H$11=$J$11,CONCATENATE(\"Gagnant Match #\",$A$11),IF($H$11>$J$11,$E$11,$G$11))","v":"Gagnant Match #10"},"vs",{"$f":"IF($H$16=$J$16,CONCATENATE(\"Perdant Match #\",$A$16),IF($H$16<$J$16,E16,$G$16))","v":"Perdant Match #15"},"","<->","","00:00:00",null,"<->",null,null,"<->",null,null,"<->"]
[20,9,null,null,{"$f":"IF($H$10=$J$10,CONCATENATE(\"Gagnant Match #\",$A$10),IF($H$10>$J$10,$E$10,$G$10))","v":"Gagnant Match #9"},"vs",{"$f":"IF($H$17=$J$17,CONCATENATE(\"Perdant Match #\",$A$17),IF($H$17<$J$17,E17,$G$17))","v":"Perdant Match #16"},"","<->","","00:00:00",null,"<->",null,null,"<->",null,null,"<->"]
[21,"III",null,null,{"$f":"IF($H$14=$J$14,CONCATENATE(\"Gagnant Match #\",$A$14),IF($H$14>$J$14,$E$14,$G$14))","v":"Gagnant Match #13"},"vs",{"$f":"IF($H$15=$J$15,CONCATENATE(\"Perdant Match #\",$A$15),IF($H$15>$J$15,$E$15,$G$15))","v":"Perdant Match #14"},"","<->","","00:00:00",null,"<->",null,null,"<->",null,null,"<->"]
[22,"III",null,null,{"$f":"IF($H$16=$J$16,CONCATENATE(\"Gagnant Match #\",$A$16),IF($H$16>$J$16,$E$16,$G$16))","v":"Gagnant Match #15"},"vs",{"$f":"IF($H$17=$J$17,CONCATENATE(\"Perdant Match #\",$A$17),IF($H$17>$J$17,$E$17,$G$17))","v":"Perdant Match #16"},"","<->","","00:00:00",null,"<->",null,null,"<->",null,null,"<->"]
[23,7,null,null,{"$f":"IF($H$18=$J$18,CONCATENATE(\"Gagnant Match #\",$A$18),IF($H$18>$J$18,$E$18,$G$18))","v":"Gagnant Match #17"},"vs",{"$f":"IF($H$19=$J$19,CONCATENATE(\"Gagnant Match #\",$A$19),IF($H$19>$J$19,$E$19,$G$19))","v":"Gagnant Match #18"},"","<->","","00:00:00",null,"<->",null,null,"<->",null,null,"<->"]
[24,7,null,null,{"$f":"IF($H$20=$J$20,CONCATENATE(\"Gagnant Match #\",$A$20),IF($H$20>$J$20,$E$20,$G$20))","v":"Gagnant Match #19"},"vs",{"$f":"IF($H$21=$J$21,CONCATENATE(\"Gagnant Match #\",$A$21),IF($H$21>$J$21,$E$21,$G$21))","v":"Gagnant Match #20"},"","<->","","00:00:00",null,"<->",null,null,"<->",null,null,"<->"]
[25,5,null,null,{"$f":"IF($H$24=$J$24,CONCATENATE(\"Gagnant Match #\",$A$24),IF($H$24>$J$24,$E$24,$G$24))","v":"Gagnant Match #23"},"vs",{"$f":"IF($H$23=$J$23,CONCATENATE(\"Perdant Match #\",$A$23),IF($H$23<$J$23,$E$23,$G$23))","v":"Perdant Match #22"},"","<->","","00:00:00",null,"<->",null,null,"<->",null,null,"<->"]
[26,5,null,null,{"$f":"IF($H$25=$J$25,CONCATENATE(\"Gagnant Match #\",$A$25),IF($H$25>$J$25,$E$25,$G$25))","v":"Gagnant Match #24"},"vs",{"$f":"IF($H$22=$J$22,CONCATENATE(\"Perdant Match #\",$A$22),IF($H$22<$J$22,$E$22,$G$22))","v":"Perdant Match #21"},"","<->","","00:00:00",null,"<->",null,null,"<->",null,null,"<->"]
[27,"SF",null,null,{"$f":"IF($H$22=$J$22,CONCATENATE(\"Gagnant Match #\",$A$22),IF($H$22>$J$22,$E$22,$G$22))","v":"Gagnant Match #21"},"vs",{"$f":"IF($H$26=$J$26,CONCATENATE(\"Winner Match #\",$A$26),IF($H$26>$J$26,$E$26,$G$26))","v":"Winner Match #25"},"","<->","","00:00:00",null,"<->",null,null,"<->",null,null,"<->"]
[28,"SF",null,null,{"$f":"IF($H$23=$J$23,CONCATENATE(\"Gagnant Match #\",$A$23),IF($H$23>$J$23,$E$23,$G$23))","v":"Gagnant Match #22"},"vs",{"$f":"IF($H$27=$J$27,CONCATENATE(\"Gagnant Match #\",$A$27),IF($H$27>$J$27,$E$27,$G$27))","v":"Gagnant Match #26"},"","<->","","00:00:00",null,"<->",null,null,"<->",null,null,"<->"]
[29,"3/4",null,null,{"$f":"IF($H$28=$J$28,CONCATENATE(\"Perdant Match #\",$A$28),IF($H$28<$J$28,$E$28,$G$28))","v":"Perdant Match #27"},"vs",{"$f":"IF($H$29=$J$29,CONCATENATE(\"Perdant Match #\",$A$29),IF($H$29<$J$29,$E$29,$G$29))","v":"Perdant Match #28"},"","<->","","00:00:00",null,"<->",null,null,"<->",null,null,"<->"]
[30,"F",null,null,{"$f":"IF($H$28=$J$28,CONCATENATE(\"Gagnant Match #\",$A$28),IF($H$28>$J$28,$E$28,$G$28))","v":"Gagnant Match #27"},"vs",{"$f":"IF($H$29=$J$29,CONCATENATE(\"GagnantMatch #\",$A$29),IF($H$29>$J$29,$E$29,$G$29))","v":"GagnantMatch #28"},"","<->","","00:00:00",null,"<->",null,null,"<->",null,null,"<->"]

{"sheet":"Tableau_16","index":3,"n_rows":55,"n_cols":10,"rows_kept":55,"cut":false,"hidden":false,"merged":[[1,2,2,7],[1,8,3,8],[4,2,4,8],[5,2,5,8],[3,2,3,5]]}
[]
[null,null,{"$f":"IF('LISTE ENGAGES'!Q3<>\" \",'LISTE ENGAGES'!P3,'LISTE ENGAGES'!Q3)","v":"APPELATION TOURNOI"},null,null,null,null,null,{"$f":"IF('LISTE ENGAGES'!Q10=\"\",'LISTE ENGAGES'!P10,'LISTE ENGAGES'!Q10)","v":"ORGANISATEUR"}]
[]
[null,null,{"$f":"IF('LISTE ENGAGES'!Q4<>\" \",'LISTE ENGAGES'!P4,'LISTE ENGAGES'!Q4)","v":"LIEU"},null,null,null,{"$f":"'LISTE ENGAGES'!G4","v":"DATE"},{"$f":"'LISTE ENGAGES'!H4","v":"GENRE"}]
[null,null,{"$f":"'LISTE ENGAGES'!C5:H5","v":"TYPE"}]
[null,null,"TABLEAU PRINCIPAL"]
[]
[]
[{"$f":"CONCATENATE(Results_16!$E$2,\" \")","v":"TS #1 "}]
[]
[{"$f":"CONCATENATE(\"\",Results_16!$A$2,\"\")","v":"1"},{"$f":"CONCATENATE(Results_16!$E$14,\" \")","v":"Gagnant Match #1 "}]
[{"$f":"CONCATENATE(\"(\",Results_16!$H$2,\" : \",Results_16!$J$2,\")\")","v":"( : )"}]
[{"$f":"CONCATENATE(Results_16!$G$2,\" \")","v":"TS #16 "}]
[null,{"$f":"CONCATENATE(\"\",Results_16!$A$14,\"\")","v":"13"},{"$f":"CONCATENATE(Results_16!$E$22,\" \")","v":"Gagnant Match #13 "}]
[{"$f":"CONCATENATE(Results_16!$E$3,\" \")","v":"TS #9 "},{"$f":"CONCATENATE(\"(\",Results_16!$H$14,\" : \",Results_16!$J$14,\")\")","v":"( : )"}]
[null,null,null,null,null,null,{"$f":"CONCATENATE(Results_16!$G$26,\" \")","v":"Perdant Match #22 "},null,null,{"$f":"CONCATENATE(Results_16!$G$13,\" \")","v":"Perdant Match #8 "}]
[{"$f":"CONCATENATE(\"\",Results_16!$A$3,\"\")","v":"2"},{"$f":"CONCATENATE(Results_16!$G$14,\" \")","v":"Gagnant Match #2 "},null,null,"DEMI-FINALES"]
[{"$f":"CONCATENATE(\"(\",Results_16!$H$3,\" : \",Results_16!$J$3,\")\")","v":"( : )"},null,null,null,null,null,null,null,{"$f":"CONCATENATE(Results_16!$E$18,\" \")","v":"Gagnant Match #12 "},{"$f":"CONCATENATE(\"\",Results_16!$A$13,\"\")","v":"12"}]
[{"$f":"CONCATENATE(Results_16!$G$3,\" \")","v":"TS #8 "},null,null,null,null,null,null,null,null,{"$f":"CONCATENATE(\"(\",Results_16!$J$13,\" : \",Results_16!$H$13,\")\")","v":"( : )"}]
[null,null,{"$f":"CONCATENATE(\"\",Results_16!$A$22,\"\")","v":"21"},{"$f":"CONCATENATE(Results_16!$E$28,\" \")","v":"Gagnant Match #21 "},{"$f":"CONCATENATE(\"\",Results_16!$A$28,\"\")","v":"27"},{"$f":"CONCATENATE(Results_16!$G$28,\" \")","v":"Winner Match #25 "},{"$f":"CONCATENATE(\"\",Results_16!$A$26,\"\")","v":"25"},{"$f":"CONCATENATE(Results_16!$E$24,\" \")","v":"Gagnant Match #17 "},{"$f":"CONCATENATE(\"\",Results_16!$A$18,\"\")","v":"17"},{"$f":"CONCATENATE(Results_16!$E$13,\" \")","v":"Perdant Match #7 "}]
[{"$f":"CONCATENATE(Results_16!$E$4,\" \")","v":"TS #5 "},null,{"$f":"CONCATENATE(\"(\",Results_16!$H$22,\" : \",Results_16!$J$22,\")\")","v":"( : )"},null,{"$f":"CONCATENATE(\"(\",Results_16!$H$28,\" : \",Results_16!$J$28,\")\")","v":"( : )"},null,{"$f":"CONCATENATE(\"(\",Results_16!$J$26,\" : \",Results_16!$H$26,\")\")","v":"( : )"},null,{"$f":"CONCATENATE(\"(\",Results_16!$H$18,\" : \",Results_16!$J$18,\")\")","v":"( : )"}]
[null,null,null,null,null,null,null,null,{"$f":"CONCATENATE(Results_16!$G$18,\" \")","v":"Perdant Match #13 "}]
[{"$f":"CONCATENATE(\"\",Results_16!$A$4,\"\")","v":"3"},{"$f":"CONCATENATE(Results_16!$E$15,\" \")","v":"Gagnant Match #3 "}]
[{"$f":"CONCATENATE(\"(\",Results_16!$H$4,\" : \",Results_16!$J$4,\")\")","v":"( : )"},null,null,null,null,null,{"$f":"CONCATENATE(Results_16!$E$26,\" \")","v":"Gagnant Match #23 "},{"$f":"CONCATENATE(\"\",Results_16!$A$24,\"\")","v":"23"},null,{"$f":"CONCATENATE(Results_16!$G$12,\" \")","v":"Perdant Match #6 "}]
[{"$f":"CONCATENATE(Results_16!$G$4,\" \")","v":"TS #12 "},null,null,null,null,null,null,{"$f":"CONCATENATE(\"(\",Results_16!$H$24,\" : \",Results_16!$J$24,\")\")","v":"( : )"}]
[null,{"$f":"CONCATENATE(\"\",Results_16!$A$15,\"\")","v":"14"},{"$f":"CONCATENATE(Results_16!$G$22,\" \")","v":"Perdant Match #14 "},null,null,null,null,null,{"$f":"CONCATENATE(Results_16!$E$19,\" \")","v":"Gagnant Match #11 "},{"$f":"CONCATENATE(\"\",Results_16!$A$12,\"\")","v":"11"}]
[{"$f":"CONCATENATE(Results_16!$E$5,\" \")","v":"TS #13 "},{"$f":"CONCATENATE(\"(\",Results_16!$H$15,\" : \",Results_16!$J$15,\")\")","v":"( : )"},null,null,null,null,null,null,null,{"$f":"CONCATENATE(\"(\",Results_16!$J$12,\" : \",Results_16!$H$12,\")\")","v":"( : )"}]
[null,null,null,{"$f":"CONCATENATE(Results_16!$E$31,\" \")","v":"Gagnant Match #27 "},null,{"$f":"CONCATENATE(Results_16!$E$30,\" \")","v":"Perdant Match #27 "},null,{"$f":"CONCATENATE(Results_16!$G$24,\" \")","v":"Gagnant Match #18 "},{"$f":"CONCATENATE(\"\",Results_16!$A$19,\"\")","v":"18"},{"$f":"CONCATENATE(Results_16!$E$12,\" \")","v":"Perdant Match #5 "}]
[{"$f":"CONCATENATE(\"\",Results_16!$A$5,\"\")","v":"4"},{"$f":"CONCATENATE(Results_16!$G$15,\" \")","v":"Gagnant Match #4 "},null,null,null,null,null,null,{"$f":"CONCATENATE(\"(\",Results_16!$H$19,\" : \",Results_16!$J$19,\")\")","v":"( : )"}]
[{"$f":"CONCATENATE(\"(\",Results_16!$H$5,\" : \",Results_16!$J$5,\")\")","v":"( : )"},null,null,"FINALE",null,"FIN. 3./4. ",null,null,{"$f":"CONCATENATE(Results_16!$G$19,\" \")","v":"Perdant Match #14 "}]
[{"$f":"CONCATENATE(Results_16!$G$5,\" \")","v":"TS #4 "}]
[null,null,null,{"$f":"CONCATENATE(\"\",Results_16!$A$31,\"\")","v":"30"},null,{"$f":"CONCATENATE(\"\",Results_16!$A$30,\"\")","v":"29"}]
[{"$f":"CONCATENATE(Results_16!$E$6,\" \")","v":"TS #3 "}]
[null,null,null,{"$f":"CONCATENATE(\"(\",Results_16!$H$31,\" : \",Results_16!$J$31,\")\")","v":"( : )"},null,{"$f":"CONCATENATE(\"(\",Results_16!$H$30,\" : \",Results_16!$J$30,\")\")","v":"( : )"}]
[{"$f":"CONCATENATE(\"\",Results_16!$A$6,\"\")","v":"5"},{"$f":"CONCATENATE(Results_16!$E$16,\" \")","v":"Gagnant Match #5 "}]
[{"$f":"CONCATENATE(\"(\",Results_16!$H$6,\" : \",Results_16!$J$6,\")\")","v":"( : )"},null,null,{"$f":"CONCATENATE(Results_16!$G$31,\" \")","v":"GagnantMatch #28 "},null,{"$f":"CONCATENATE(Results_16!$G$30,\" \")","v":"Perdant Match #28 "}]
[{"$f":"CONCATENATE(Results_16!$G$6,\" \")","v":"TS #14 "}]
[null,{"$f":"CONCATENATE(\"\",Results_16!$A$16,\"\")","v":"15"},{"$f":"CONCATENATE(Results_16!$E$23,\" \")","v":"Gagnant Match #15 "}]
[{"$f":"CONCATENATE(Results_16!$E$7,\" \")","v":"TS #11 "},{"$f":"CONCATENATE(\"(\",Results_16!$H$16,\" : \",Results_16!$J$16,\")\")","v":"( : )"}]
[null,null,null,null,null,null,{"$f":"CONCATENATE(Results_16!$G$27,\" \")","v":"Perdant Match #21 "},null,null,{"$f":"CONCATENATE(Results_16!$G$11,\" \")","v":"Perdant Match #4 "}]
[{"$f":"CONCATENATE(\"\",Results_16!$A$7,\"\")","v":"6"},{"$f":"CONCATENATE(Results_16!$G$16,\" \")","v":"Gagnant Match #6 "}]
[{"$f":"CONCATENATE(\"(\",Results_16!$H$7,\" : \",Results_16!$J$7,\")\")","v":"( : )"},null,null,null,null,null,null,null,{"$f":"CONCATENATE(Results_16!$E$20,\" \")","v":"Gagnant Match #10 "},{"$f":"CONCATENATE(\"\",Results_16!$A$11,\"\")","v":"10"}]
[{"$f":"CONCATENATE(Results_16!$G$7,\" \")","v":"TS #6 "},null,null,null,null,null,null,null,null,{"$f":"CONCATENATE(\"(\",Results_16!$J$11,\" : \",Results_16!$H$11,\")\")","v":"( : )"}]
[null,null,{"$f":"CONCATENATE(\"\",Results_16!$A$23,\"\")","v":"22"},{"$f":"CONCATENATE(Results_16!$E$29,\" \")","v":"Gagnant Match #22 "},{"$f":"CONCATENATE(\"\",Results_16!$A$29,\"\")","v":"28"},{"$f":"CONCATENATE(Results_16!$G$29,\" \")","v":"Gagnant Match #26 "},{"$f":"CONCATENATE(\"\",Results_16!$A$27,\"\")","v":"26"},null,{"$f":"CONCATENATE(\"\",Results_16!$A$20,\"\")","v":"19"},{"$f":"CONCATENATE(Results_16!$E$11,\" \")","v":"Perdant Match #3 "}]
[{"$f":"CONCATENATE(Results_16!$E$8,\" \")","v":"TS #7 "},null,{"$f":"CONCATENATE(\"(\",Results_16!$H$23,\" : \",Results_16!$J$23,\")\")","v":"( : )"},null,{"$f":"CONCATENATE(\"(\",Results_16!$H$29,\" : \",Results_16!$J$29,\")\")","v":"( : )"},null,{"$f":"CONCATENATE(\"(\",Results_16!$J$27,\" : \",Results_16!$H$27,\")\")","v":"( : )"},{"$f":"CONCATENATE(Results_16!$E$25,\" \")","v":"Gagnant Match #19 "},{"$f":"CONCATENATE(\"(\",Results_16!$H$20,\" : \",Results_16!$J$20,\")\")","v":"( : )"}]
[null,null,null,null,null,null,null,null,{"$f":"CONCATENATE(Results_16!$G$20,\" \")","v":"Perdant Match #15 "}]
[{"$f":"CONCATENATE(\"\",Results_16!$A$8,\"\")","v":"7"},{"$f":"CONCATENATE(Results_16!$E$17,\" \")","v":"Gagnant Match #7 "}]
[{"$f":"CONCATENATE(\"(\",Results_16!$H$8,\" : \",Results_16!$J$8,\")\")","v":"( : )"},null,null,null,null,null,{"$f":"CONCATENATE(Results_16!$E$27,\" \")","v":"Gagnant Match #24 "},{"$f":"CONCATENATE(\"\",Results_16!$A$25,\"\")","v":"24"},null,{"$f":"CONCATENATE(Results_16!$G$10,\" \")","v":"Perdant Match #2 "}]
[{"$f":"CONCATENATE(Results_16!$G$8,\" \")","v":"TS #10 "},null,null,null,null,null,null,{"$f":"CONCATENATE(\"(\",Results_16!$H$25,\" : \",Results_16!$J$25,\")\")","v":"( : )"}]
[null,{"$f":"CONCATENATE(\"\",Results_16!$A$17,\"\")","v":"16"},{"$f":"CONCATENATE(Results_16!$G$23,\" \")","v":"Perdant Match #16 "},null,null,null,null,null,{"$f":"CONCATENATE(Results_16!$E$21,\" \")","v":"Gagnant Match #9 "},{"$f":"CONCATENATE(\"\",Results_16!$A$10,\"\")","v":"9"}]
[{"$f":"CONCATENATE(Results_16!$E$9,\" \")","v":"TS #15 "},{"$f":"CONCATENATE(\"(\",Results_16!$H$17,\" : \",Results_16!$J$17,\")\")","v":"( : )"},null,null,null,null,null,null,null,{"$f":"CONCATENATE(\"(\",Results_16!$J$10,\" : \",Results_16!$H$10,\")\")","v":"( : )"}]
[null,null,null,null,null,null,null,{"$f":"CONCATENATE(Results_16!$G$25,\" \")","v":"Gagnant Match #20 "},{"$f":"CONCATENATE(\"\",Results_16!$A$21,\"\")","v":"20"},{"$f":"CONCATENATE(Results_16!$E$10,\" \")","v":"Perdant Match #1 "}]
[{"$f":"CONCATENATE(\"\",Results_16!$A$9,\"\")","v":"8"},{"$f":"CONCATENATE(Results_16!$G$17,\" \")","v":"Gagnant Match #8 "},null,null,null,null,null,null,{"$f":"CONCATENATE(\"(\",Results_16!$H$21,\" : \",Results_16!$J$21,\")\")","v":"( : )"}]
[{"$f":"CONCATENATE(\"(\",Results_16!$H$9,\" : \",Results_16!$J$9,\")\")","v":"( : )"},null,null,null,null,null,null,null,{"$f":"CONCATENATE(Results_16!$G$21,\" \")","v":"Perdant Match #16 "}]
[{"$f":"CONCATENATE(Results_16!$G$9,\" \")","v":"TS #2 "}]

{"sheet":"RELEVE","index":4,"n_rows":82,"n_cols":14,"rows_kept":82,"cut":false,"hidden":false,"merged":[[81,2,87,10],[14,4,14,6],[15,2,15,3],[15,4,15,6],[16,2,16,3],[16,4,16,6],[17,2,17,3],[17,4,17,6],[18,2,18,3],[18,4,18,6],[19,2,19,3],[19,4,19,6],[72,2,78,10],[9,8,9,9],[2,2,2,3],[2,4,2,10],[3,2,3,3],[3,4,3,5],[4,2,4,3],[4,4,4,5],[5,2,5,3],[5,4,5,5],[6,2,6,3],[6,4,6,5],[8,8,8,9]]}
[null,null,"RELEVE DES RESULTATS ET SANCTIONS - TOURNOI DE BEACH VOLLEY"]
[]
[null,null,"APPELATION DU TOURNOI",null,{"$f":"IF('LISTE ENGAGES'!Q4=\"\",\"\",'LISTE ENGAGES'!Q4)","v":""}]
[null,null,"TYPE",null,{"$f":"IF('LISTE ENGAGES'!Q5=\"\",\"\",'LISTE ENGAGES'!Q5)","v":""}]
[null,null,"GENRE",null,{"$f":"IF('LISTE ENGAGES'!Q9=\"\",\"\",'LISTE ENGAGES'!Q9)","v":""}]
[null,null,"DATE",null,{"$f":"IF('LISTE ENGAGES'!Q7=\"\",\"\",CONCATENATE('LISTE ENGAGES'!Q7,\"-\",'LISTE ENGAGES'!Q8,\"/\",'LISTE ENGAGES'!Q6))","v":""}]
[null,null,"ORGANISATEUR",null,{"$f":"IF('LISTE ENGAGES'!Q10=\"\",\"\",'LISTE ENGAGES'!Q10)","v":""}]
[]
[null,null,"NOMBRE EQUIPE TABLEAU :",null,null,"PRINCIPAL",null,null,"QUALIFICATION"]
[null,null,"NOMBRE EQUIPE PRESENTES PAR TABLEAU",null,null,"PRINCIPAL",null,null,"QUALIFICATION"]
[]
[]
[null,null,"COMPOSITION DE LA COMMISSION DE DIRECTION"]
[]
[null,null,"DELEGUE INSTANCE FEDERAL"]
[null,null,"SUPERVISEUR"]
[null,null,"JUGE ARBITRE"]
[null,null,"ORGANISATEUR"]
[null,null,"REPRESENTANT JOUEURS"]
[null,null,"RAPPORTEUR*"]
[]
[]
[]
[]
[]
[null,null,"EQUIPES ABSENTES"]
[null,null,"NOM","PRENOM","LIC J1","club J1","NOM2","PRENOM3","LIC J2","club J2"]
[]
[]
[]
[]
[]
[]
[null,null,"RECLAMATIONS"]
[null,null,"NOM","PRENOM","LIC J1","club J1","NOM2","PRENOM3","LIC J2","club J2","RANG","NIVEAU","MOTIF ","AVIS COMMISSION"]
[null,1]
[null,2]
[null,3]
[null,4]
[null,5]
[null,6]
[]
[null,null,"EQUIPES/JOUEURS SANCTIONNES"]
[null,null,"NOM","PRENOM","LIC J1","club J1","NOM2","PRENOM3","LIC J2","club J2","RANG","SANCTION","MOTIF ","AVIS COMMISSION"]
[null,1]
[null,2]
[null,3]
[null,4]
[null,5]
[null,6]
[]
[null,null,"CLASSEMENT FINAL"]
[null,null,"NOM","PRENOM","LIC J1","club J1","NOM2","PRENOM3","LIC J2","club J2","RANG"]
[null,null,{"$f":"IF('LISTE ENGAGES'!C9=\"\",\"\",'LISTE ENGAGES'!C9)","v":""},{"$f":"IF('LISTE ENGAGES'!D9=\"\",\"\",'LISTE ENGAGES'!D9)","v":""},{"$f":"IF('LISTE ENGAGES'!E9=\"\",\"\",'LISTE ENGAGES'!E9)","v":""},{"$f":"IF('LISTE ENGAGES'!F9=\"\",\"\",'LISTE ENGAGES'!F9)","v":""},{"$f":"IF('LISTE ENGAGES'!G9=\"\",\"\",'LISTE ENGAGES'!G9)","v":""},{"$f":"IF('LISTE ENGAGES'!H9=\"\",\"\",'LISTE ENGAGES'!H9)","v":""},{"$f":"IF('LISTE ENGAGES'!I9=\"\",\"\",'LISTE ENGAGES'!I9)","v":""},{"$f":"IF('LISTE ENGAGES'!J9=\"\",\"\",'LISTE ENGAGES'!J9)","v":""}]
[null,null,{"$f":"IF('LISTE ENGAGES'!C10=\"\",\"\",'LISTE ENGAGES'!C10)","v":""},{"$f":"IF('LISTE ENGAGES'!D10=\"\",\"\",'LISTE ENGAGES'!D10)","v":""},{"$f":"IF('LISTE ENGAGES'!E10=\"\",\"\",'LISTE ENGAGES'!E10)","v":""},{"$f":"IF('LISTE ENGAGES'!F10=\"\",\"\",'LISTE ENGAGES'!F10)","v":""},{"$f":"IF('LISTE ENGAGES'!G10=\"\",\"\",'LISTE ENGAGES'!G10)","v":""},{"$f":"IF('LISTE ENGAGES'!H10=\"\",\"\",'LISTE ENGAGES'!H10)","v":""},{"$f":"IF('LISTE ENGAGES'!I10=\"\",\"\",'LISTE ENGAGES'!I10)","v":""},{"$f":"IF('LISTE ENGAGES'!J10=\"\",\"\",'LISTE ENGAGES'!J10)","v":""}]
[null,null,{"$f":"IF('LISTE ENGAGES'!C11=\"\",\"\",'LISTE ENGAGES'!C11)","v":""},{"$f":"IF('LISTE ENGAGES'!D11=\"\",\"\",'LISTE ENGAGES'!D11)","v":""},{"$f":"IF('LISTE ENGAGES'!E11=\"\",\"\",'LISTE ENGAGES'!E11)","v":""},{"$f":"IF('LISTE ENGAGES'!F11=\"\",\"\",'LISTE ENGAGES'!F11)","v":""},{"$f":"IF('LISTE ENGAGES'!G11=\"\",\"\",'LISTE ENGAGES'!G11)","v":""},{"$f":"IF('LISTE ENGAGES'!H11=\"\",\"\",'LISTE ENGAGES'!H11)","v":""},{"$f":"IF('LISTE ENGAGES'!I11=\"\",\"\",'LISTE ENGAGES'!I11)","v":""},{"$f":"IF('LISTE ENGAGES'!J11=\"\",\"\",'LISTE ENGAGES'!J11)","v":""}]
[null,null,{"$f":"IF('LISTE ENGAGES'!C12=\"\",\"\",'LISTE ENGAGES'!C12)","v":""},{"$f":"IF('LISTE ENGAGES'!D12=\"\",\"\",'LISTE ENGAGES'!D12)","v":""},{"$f":"IF('LISTE ENGAGES'!E12=\"\",\"\",'LISTE ENGAGES'!E12)","v":""},{"$f":"IF('LISTE ENGAGES'!F12=\"\",\"\",'LISTE ENGAGES'!F12)","v":""},{"$f":"IF('LISTE ENGAGES'!G12=\"\",\"\",'LISTE ENGAGES'!G12)","v":""},{"$f":"IF('LISTE ENGAGES'!H12=\"\",\"\",'LISTE ENGAGES'!H12)","v":""},{"$f":"IF('LISTE ENGAGES'!I12=\"\",\"\",'LISTE ENGAGES'!I12)","v":""},{"$f":"IF('LISTE ENGAGES'!J12=\"\",\"\",'LISTE ENGAGES'!J12)","v":""}]
[null,null,{"$f":"IF('LISTE ENGAGES'!C13=\"\",\"\",'LISTE ENGAGES'!C13)","v":""},{"$f":"IF('LISTE ENGAGES'!D13=\"\",\"\",'LISTE ENGAGES'!D13)","v":""},{"$f":"IF('LISTE ENGAGES'!E13=\"\",\"\",'LISTE ENGAGES'!E13)","v":""},{"$f":"IF('LISTE ENGAGES'!F13=\"\",\"\",'LISTE ENGAGES'!F13)","v":""},{"$f":"IF('LISTE ENGAGES'!G13=\"\",\"\",'LISTE ENGAGES'!G13)","v":""},{"$f":"IF('LISTE ENGAGES'!H13=\"\",\"\",'LISTE ENGAGES'!H13)","v":""},{"$f":"IF('LISTE ENGAGES'!I13=\"\",\"\",'LISTE ENGAGES'!I13)","v":""},{"$f":"IF('LISTE ENGAGES'!J13=\"\",\"\",'LISTE ENGAGES'!J13)","v":""}]
[null,null,{"$f":"IF('LISTE ENGAGES'!C14=\"\",\"\",'LISTE ENGAGES'!C14)","v":""},{"$f":"IF('LISTE ENGAGES'!D14=\"\",\"\",'LISTE ENGAGES'!D14)","v":""},{"$f":"IF('LISTE ENGAGES'!E14=\"\",\"\",'LISTE ENGAGES'!E14)","v":""},{"$f":"IF('LISTE ENGAGES'!F14=\"\",\"\",'LISTE ENGAGES'!F14)","v":""},{"$f":"IF('LISTE ENGAGES'!G14=\"\",\"\",'LISTE ENGAGES'!G14)","v":""},{"$f":"IF('LISTE ENGAGES'!H14=\"\",\"\",'LISTE ENGAGES'!H14)","v":""},{"$f":"IF('LISTE ENGAGES'!I14=\"\",\"\",'LISTE ENGAGES'!I14)","v":""},{"$f":"IF('LISTE ENGAGES'!J14=\"\",\"\",'LISTE ENGAGES'!J14)","v":""}]
[null,null,{"$f":"IF('LISTE ENGAGES'!C15=\"\",\"\",'LISTE ENGAGES'!C15)","v":""},{"$f":"IF('LISTE ENGAGES'!D15=\"\",\"\",'LISTE ENGAGES'!D15)","v":""},{"$f":"IF('LISTE ENGAGES'!E15=\"\",\"\",'LISTE ENGAGES'!E15)","v":""},{"$f":"IF('LISTE ENGAGES'!F15=\"\",\"\",'LISTE ENGAGES'!F15)","v":""},{"$f":"IF('LISTE ENGAGES'!G15=\"\",\"\",'LISTE ENGAGES'!G15)","v":""},{"$f":"IF('LISTE ENGAGES'!H15=\"\",\"\",'LISTE ENGAGES'!H15)","v":""},{"$f":"IF('LISTE ENGAGES'!I15=\"\",\"\",'LISTE ENGAGES'!I15)","v":""},{"$f":"IF('LISTE ENGAGES'!J15=\"\",\"\",'LISTE ENGAGES'!J15)","v":""}]
[null,null,{"$f":"IF('LISTE ENGAGES'!C16=\"\",\"\",'LISTE ENGAGES'!C16)","v":""},{"$f":"IF('LISTE ENGAGES'!D16=\"\",\"\",'LISTE ENGAGES'!D16)","v":""},{"$f":"IF('LISTE ENGAGES'!E16=\"\",\"\",'LISTE ENGAGES'!E16)","v":""},{"$f":"IF('LISTE ENGAGES'!F16=\"\",\"\",'LISTE ENGAGES'!F16)","v":""},{"$f":"IF('LISTE ENGAGES'!G16=\"\",\"\",'LISTE ENGAGES'!G16)","v":""},{"$f":"IF('LISTE ENGAGES'!H16=\"\",\"\",'LISTE ENGAGES'!H16)","v":""},{"$f":"IF('LISTE ENGAGES'!I16=\"\",\"\",'LISTE ENGAGES'!I16)","v":""},{"$f":"IF('LISTE ENGAGES'!J16=\"\",\"\",'LISTE ENGAGES'!J16)","v":""}]
[null,null,{"$f":"IF('LISTE ENGAGES'!C17=\"\",\"\",'LISTE ENGAGES'!C17)","v":""},{"$f":"IF('LISTE ENGAGES'!D17=\"\",\"\",'LISTE ENGAGES'!D17)","v":""},{"$f":"IF('LISTE ENGAGES'!E17=\"\",\"\",'LISTE ENGAGES'!E17)","v":""},{"$f":"IF('LISTE ENGAGES'!F17=\"\",\"\",'LISTE ENGAGES'!F17)","v":""},{"$f":"IF('LISTE ENGAGES'!G17=\"\",\"\",'LISTE ENGAGES'!G17)","v":""},{"$f":"IF('LISTE ENGAGES'!H17=\"\",\"\",'LISTE ENGAGES'!H17)","v":""},{"$f":"IF('LISTE ENGAGES'!I17=\"\",\"\",'LISTE ENGAGES'!I17)","v":""},{"$f":"IF('LISTE ENGAGES'!J17=\"\",\"\",'LISTE ENGAGES'!J17)","v":""}]
[null,null,{"$f":"IF('LISTE ENGAGES'!C18=\"\",\"\",'LISTE ENGAGES'!C18)","v":""},{"$f":"IF('LISTE ENGAGES'!D18=\"\",\"\",'LISTE ENGAGES'!D18)","v":""},{"$f":"IF('LISTE ENGAGES'!E18=\"\",\"\",'LISTE ENGAGES'!E18)","v":""},{"$f":"IF('LISTE ENGAGES'!F18=\"\",\"\",'LISTE ENGAGES'!F18)","v":""},{"$f":"IF('LISTE ENGAGES'!G18=\"\",\"\",'LISTE ENGAGES'!G18)","v":""},{"$f":"IF('LISTE ENGAGES'!H18=\"\",\"\",'LISTE ENGAGES'!H18)","v":""},{"$f":"IF('LISTE ENGAGES'!I18=\"\",\"\",'LISTE ENGAGES'!I18)","v":""},{"$f":"IF('LISTE ENGAGES'!J18=\"\",\"\",'LISTE ENGAGES'!J18)","v":""}]
[null,null,{"$f":"IF('LISTE ENGAGES'!C19=\"\",\"\",'LISTE ENGAGES'!C19)","v":""},{"$f":"IF('LISTE ENGAGES'!D19=\"\",\"\",'LISTE ENGAGES'!D19)","v":""},{"$f":"IF('LISTE ENGAGES'!E19=\"\",\"\",'LISTE ENGAGES'!E19)","v":""},{"$f":"IF('LISTE ENGAGES'!F19=\"\",\"\",'LISTE ENGAGES'!F19)","v":""},{"$f":"IF('LISTE ENGAGES'!G19=\"\",\"\",'LISTE ENGAGES'!G19)","v":""},{"$f":"IF('LISTE ENGAGES'!H19=\"\",\"\",'LISTE ENGAGES'!H19)","v":""},{"$f":"IF('LISTE ENGAGES'!I19=\"\",\"\",'LISTE ENGAGES'!I19)","v":""},{"$f":"IF('LISTE ENGAGES'!J19=\"\",\"\",'LISTE ENGAGES'!J19)","v":""}]
[null,null,{"$f":"IF('LISTE ENGAGES'!C20=\"\",\"\",'LISTE ENGAGES'!C20)","v":""},{"$f":"IF('LISTE ENGAGES'!D20=\"\",\"\",'LISTE ENGAGES'!D20)","v":""},{"$f":"IF('LISTE ENGAGES'!E20=\"\",\"\",'LISTE ENGAGES'!E20)","v":""},{"$f":"IF('LISTE ENGAGES'!F20=\"\",\"\",'LISTE ENGAGES'!F20)","v":""},{"$f":"IF('LISTE ENGAGES'!G20=\"\",\"\",'LISTE ENGAGES'!G20)","v":""},{"$f":"IF('LISTE ENGAGES'!H20=\"\",\"\",'LISTE ENGAGES'!H20)","v":""},{"$f":"IF('LISTE ENGAGES'!I20=\"\",\"\",'LISTE ENGAGES'!I20)","v":""},{"$f":"IF('LISTE ENGAGES'!J20=\"\",\"\",'LISTE ENGAGES'!J20)","v":""}]
[null,null,{"$f":"IF('LISTE ENGAGES'!C21=\"\",\"\",'LISTE ENGAGES'!C21)","v":""},{"$f":"IF('LISTE ENGAGES'!D21=\"\",\"\",'LISTE ENGAGES'!D21)","v":""},{"$f":"IF('LISTE ENGAGES'!E21=\"\",\"\",'LISTE ENGAGES'!E21)","v":""},{"$f":"IF('LISTE ENGAGES'!F21=\"\",\"\",'LISTE ENGAGES'!F21)","v":""},{"$f":"IF('LISTE ENGAGES'!G21=\"\",\"\",'LISTE ENGAGES'!G21)","v":""},{"$f":"IF('LISTE ENGAGES'!H21=\"\",\"\",'LISTE ENGAGES'!H21)","v":""},{"$f":"IF('LISTE ENGAGES'!I21=\"\",\"\",'LISTE ENGAGES'!I21)","v":""},{"$f":"IF('LISTE ENGAGES'!J21=\"\",\"\",'LISTE ENGAGES'!J21)","v":""}]
[null,null,{"$f":"IF('LISTE ENGAGES'!C22=\"\",\"\",'LISTE ENGAGES'!C22)","v":""},{"$f":"IF('LISTE ENGAGES'!D22=\"\",\"\",'LISTE ENGAGES'!D22)","v":""},{"$f":"IF('LISTE ENGAGES'!E22=\"\",\"\",'LISTE ENGAGES'!E22)","v":""},{"$f":"IF('LISTE ENGAGES'!F22=\"\",\"\",'LISTE ENGAGES'!F22)","v":""},{"$f":"IF('LISTE ENGAGES'!G22=\"\",\"\",'LISTE ENGAGES'!G22)","v":""},{"$f":"IF('LISTE ENGAGES'!H22=\"\",\"\",'LISTE ENGAGES'!H22)","v":""},{"$f":"IF('LISTE ENGAGES'!I22=\"\",\"\",'LISTE ENGAGES'!I22)","v":""},{"$f":"IF('LISTE ENGAGES'!J22=\"\",\"\",'LISTE ENGAGES'!J22)","v":""}]
[null,null,{"$f":"IF('LISTE ENGAGES'!C23=\"\",\"\",'LISTE ENGAGES'!C23)","v":""},{"$f":"IF('LISTE ENGAGES'!D23=\"\",\"\",'LISTE ENGAGES'!D23)","v":""},{"$f":"IF('LISTE ENGAGES'!E23=\"\",\"\",'LISTE ENGAGES'!E23)","v":""},{"$f":"IF('LISTE ENGAGES'!F23=\"\",\"\",'LISTE ENGAGES'!F23)","v":""},{"$f":"IF('LISTE ENGAGES'!G23=\"\",\"\",'LISTE ENGAGES'!G23)","v":""},{"$f":"IF('LISTE ENGAGES'!H23=\"\",\"\",'LISTE ENGAGES'!H23)","v":""},{"$f":"IF('LISTE ENGAGES'!I23=\"\",\"\",'LISTE ENGAGES'!I23)","v":""},{"$f":"IF('LISTE ENGAGES'!J23=\"\",\"\",'LISTE ENGAGES'!J23)","v":""}]
[null,null,{"$f":"IF('LISTE ENGAGES'!C24=\"\",\"\",'LISTE ENGAGES'!C24)","v":""},{"$f":"IF('LISTE ENGAGES'!D24=\"\",\"\",'LISTE ENGAGES'!D24)","v":""},{"$f":"IF('LISTE ENGAGES'!E24=\"\",\"\",'LISTE ENGAGES'!E24)","v":""},{"$f":"IF('LISTE ENGAGES'!F24=\"\",\"\",'LISTE ENGAGES'!F24)","v":""},{"$f":"IF('LISTE ENGAGES'!G24=\"\",\"\",'LISTE ENGAGES'!G24)","v":""},{"$f":"IF('LISTE ENGAGES'!H24=\"\",\"\",'LISTE ENGAGES'!H24)","v":""},{"$f":"IF('LISTE ENGAGES'!I24=\"\",\"\",'LISTE ENGAGES'!I24)","v":""},{"$f":"IF('LISTE ENGAGES'!J24=\"\",\"\",'LISTE ENGAGES'!J24)","v":""}]
[]
[]
[]
[null,null,"REMARQUES :"]
[]
[]
[]
[]
[]
[]
[]
[]
[null,null,"SIGNATURES :"]